Target
Nucleotide-binding oligomerization domain-containing protein 1
Ligand
BDBM62257
Substrate
Meas. Tech.
ChEMBL_812915 (CHEMBL2020290)
IC50
510±n/a nM
Citation
 Khan, PMCorrea, RGDivlianska, DBPeddibhotla, SSessions, EHMagnuson, GBrown, BSuyama, EYuan, HMangravita-Novo, AVicchiarelli, MSu, YVasile, SSmith, LHDiaz, PWReed, JCRoth, GP Identification of Inhibitors of NOD1-Induced Nuclear Factor-żB Activation. ACS Med Chem Lett 2:780-785 (2011)  
Target
Name:
Nucleotide-binding oligomerization domain-containing protein 1
Synonyms:
CARD4 NOD1_HUMAN | nucleotide-binding oligomerization domain containing 1
Type:
Enzyme Catalytic Domain
Mol. Mass.:
107699.03
Organism:
Homo sapiens (Human)
Description:
gi_5174617
Residue:
953
  
Inhibitor
Name:
BDBM62257
Synonyms:
MLS-0360553.0001 cyclopropyl-[5-[4-(4-methoxyphenyl)piperazin-1-yl]sulfonyl-2-methyl-2,3-dihydroindol-1-yl]methanone cyclopropyl-[5-[[4-(4-methoxyphenyl)-1-piperazinyl]sulfonyl]-2-methyl-2,3-dihydroindol-1-yl]methanone
Type:
Small organic molecule
Emp. Form.:
C24H29N3O4S
Mol. Mass.:
455.57
SMILES:
COc1ccc(cc1)N1CCN(CC1)S(=O)(=O)c1ccc2N(C(C)Cc2c1)C(=O)C1CC1
: