Target
cAMP-specific 3',5'-cyclic phosphodiesterase 7B
Ligand
BDBM50381288
Substrate
Meas. Tech.
ChEMBL_814420 (CHEMBL2019816)
IC50
31±n/a nM
Citation
 Banerjee, AYadav, PSBajpai, MSangana, RRGullapalli, SGudi, GSGharat, LA Isothiazole and isoxazole fused pyrimidones as PDE7 inhibitors: SAR and pharmacokinetic evaluation. Bioorg Med Chem Lett 22:3223-8 (2012)  
Target
Name:
cAMP-specific 3',5'-cyclic phosphodiesterase 7B
Synonyms:
3',5'-cyclic phosphodiesterase PDE7B_HUMAN Phosphodiesterase 7B (PDE7B) | cAMP-specific 3',5'-cyclic phosphodiesterase 7B
Type:
Enzyme
Mol. Mass.:
51842.76
Organism:
Homo sapiens (Human)
Description:
Q9NP56
Residue:
450
  
Inhibitor
Name:
BDBM50381288
Synonyms:
CHEMBL2019021
Type:
Small organic molecule
Emp. Form.:
C18H20N4O2S
Mol. Mass.:
356.442
SMILES:
COc1cc(N)ccc1-c1nc2snc(C3CCCCC3)c2c(=O)[nH]1
: