Target
11-beta-hydroxysteroid dehydrogenase 1
Ligand
BDBM50382818
Substrate
Meas. Tech.
ChEMBL_815021 (CHEMBL2027167)
EC50
69±n/a nM
Citation
 Zhang, LChen, JNing, MZou, QLeng, YShen, J Synthesis and evaluation of piperidine urea derivatives as efficacious 11ß-hydroxysteroid dehydrogenase type 1 inhibitors in diabetic ob/ob mice. Bioorg Med Chem Lett 22:2748-52 (2012)  
Target
Name:
11-beta-hydroxysteroid dehydrogenase 1
Synonyms:
11-DH 11-beta-Hydroxysteroid Dehydrogenase 1 (11-beta-HSD1) 11beta-HSD1A Corticosteroid 11-beta-dehydrogenase isozyme 1 (11-beta-HSD-1) Hsd11 | Hsd11b1
Type:
Enzyme
Mol. Mass.:
32369.70
Organism:
Mus musculus (mouse)
Description:
P50172
Residue:
292
  
Inhibitor
Name:
BDBM50382818
Synonyms:
CHEMBL2023430
Type:
Small organic molecule
Emp. Form.:
C26H28ClN3O4S
Mol. Mass.:
514.036
SMILES:
CN(C1C2CC3CC(C2)CC1C3)C(=O)c1cccc(CN2C(=O)Nc3ccc(Cl)cc3S2(=O)=O)c1
: