Target
Platelet-derived growth factor receptor beta
Ligand
BDBM50384725
Substrate
Meas. Tech.
ChEMBL_820940 (CHEMBL2038985)
IC50
100±n/a nM
Citation
 Albaugh, PFan, YMi, YSun, FAdrian, FLi, NJia, YSarkisova, YKreusch, AHood, TLu, MLiu, GHuang, SLiu, ZLoren, JTuntland, TKaranewsky, DSSeidel, HMMolteni, V Discovery of GNF-5837, a Selective TRK Inhibitor with Efficacy in Rodent Cancer Tumor Models. ACS Med Chem Lett 3:140-145 (2012)  
Target
Name:
Platelet-derived growth factor receptor beta
Synonyms:
2.7.10.1 Beta-type platelet-derived growth factor receptor CD140b antigen PDGF-R-beta PDGFR-beta Pdgfr Pdgfrb Platelet-derived growth factor receptor | Platelet-derived growth factor receptor 1
Type:
Enzyme
Mol. Mass.:
122771.00
Organism:
Mus musculus (mouse)
Description:
P05622
Residue:
1098
  
Inhibitor
Name:
BDBM50384725
Synonyms:
CHEMBL2037209
Type:
Small organic molecule
Emp. Form.:
C31H23F3N6O2
Mol. Mass.:
568.5485
SMILES:
Cc1cn(cn1)-c1cc(cc(c1)C(F)(F)F)C(=O)Nc1cccc(Nc2ccc3\C(=C\c4ccc[nH]4)C(=O)Nc3c2)c1
: