Target
ALK tyrosine kinase receptor
Ligand
BDBM50384726
Substrate
Meas. Tech.
ChEMBL_820924 (CHEMBL2038865)
IC50
5900±n/a nM
Citation
 Albaugh, PFan, YMi, YSun, FAdrian, FLi, NJia, YSarkisova, YKreusch, AHood, TLu, MLiu, GHuang, SLiu, ZLoren, JTuntland, TKaranewsky, DSSeidel, HMMolteni, V Discovery of GNF-5837, a Selective TRK Inhibitor with Efficacy in Rodent Cancer Tumor Models. ACS Med Chem Lett 3:140-145 (2012)  
Target
Name:
ALK tyrosine kinase receptor
Synonyms:
ALK_MOUSE Anaplastic lymphoma kinase | CD_antigen=CD246
Type:
PROTEIN
Mol. Mass.:
174957.04
Organism:
Mus musculus
Description:
ChEMBL_820924
Residue:
1621
  
Inhibitor
Name:
BDBM50384726
Synonyms:
CHEMBL2037208
Type:
Small organic molecule
Emp. Form.:
C27H19F3N4O2
Mol. Mass.:
488.4606
SMILES:
FC(F)(F)c1cccc(c1)C(=O)Nc1cccc(Nc2ccc3\C(=C\c4ccc[nH]4)C(=O)Nc3c2)c1
: