Target
Polymerase acidic protein
Ligand
BDBM50385486
Substrate
Meas. Tech.
ChEMBL_823233 (CHEMBL2040651)
Ki
1200±n/a nM
Citation
 Baughman, BMJake Slavish, PDuBois, RMBoyd, VAWhite, SWWebb, TR Identification of influenza endonuclease inhibitors using a novel fluorescence polarization assay. ACS Chem Biol 7:526-34 (2012)  
Target
Name:
Polymerase acidic protein
Synonyms:
Hepatitis C virus polyprotein PA/PB1 Polymerase acidic protein | RNA-directed RNA polymerase subunit P2
Type:
PROTEIN
Mol. Mass.:
82573.84
Organism:
Hepatitis C virus
Description:
ChEMBL_64976
Residue:
716
  
Inhibitor
Name:
BDBM50385486
Synonyms:
CHEMBL2040576
Type:
Small organic molecule
Emp. Form.:
C16H12FN5O3
Mol. Mass.:
341.2966
SMILES:
Oc1c(nc([nH]c1=O)-c1cnccn1)C(=O)NCc1ccc(F)cc1
: