Target
Mu-type opioid receptor
Ligand
BDBM50386381
Substrate
Meas. Tech.
ChEMBL_826807 (CHEMBL2051428)
Ki
160±n/a nM
Citation
 Renton, PGreen, BMaddaford, SRakhit, SAndrews, JS NOpiates: Novel Dual Action Neuronal Nitric Oxide Synthase Inhibitors with µ-Opioid Agonist Activity. ACS Med Chem Lett 3:227-231 (2012)  
Target
Name:
Mu-type opioid receptor
Synonyms:
M-OR-1 MOR-1 MUOR1 Mu opiate receptor OPRM1 hMOP | mu-type opioid receptor isoform MOR-1
Type:
G Protein-Coupled Receptor (GPCR)
Mol. Mass.:
44789.51
Organism:
Homo sapiens (Human)
Description:
P35372
Residue:
400
  
Inhibitor
Name:
BDBM50386381
Synonyms:
Nucynta Tapentadol
Type:
Small organic molecule
Emp. Form.:
C14H23NO
Mol. Mass.:
221.3385
SMILES:
CC[C@H]([C@@H](C)CN(C)C)c1cccc(O)c1
: