Target
Nitric oxide synthase, brain
Ligand
BDBM50386380
Substrate
Meas. Tech.
ChEMBL_826804 (CHEMBL2051425)
IC50
37200±n/a nM
Citation
 Renton, PGreen, BMaddaford, SRakhit, SAndrews, JS NOpiates: Novel Dual Action Neuronal Nitric Oxide Synthase Inhibitors with µ-Opioid Agonist Activity. ACS Med Chem Lett 3:227-231 (2012)  
Target
Name:
Nitric oxide synthase, brain
Synonyms:
Constitutive NOS NC-NOS NOS type I nNOS NOS1_HUMAN Neuronal nitric oxide synthase Nitric oxide synthase, neuronal (nNOS) bNOS | nNOS
Type:
Homodimer
Mol. Mass.:
160985.98
Organism:
Homo sapiens (Human)
Description:
P29475
Residue:
1434
  
Inhibitor
Name:
BDBM50386380
Synonyms:
CHEMBL2048417
Type:
Small organic molecule
Emp. Form.:
C27H33N5OS
Mol. Mass.:
475.649
SMILES:
CCOc1ccc(Cc2nc3ccc(cc3n2CCN(CC)CC)N=C(N)c2cccs2)cc1
: