Target
Nitric oxide synthase, endothelial
Ligand
BDBM50386384
Substrate
Meas. Tech.
ChEMBL_826805 (CHEMBL2051426)
IC50
4040±n/a nM
Citation
 Renton, PGreen, BMaddaford, SRakhit, SAndrews, JS NOpiates: Novel Dual Action Neuronal Nitric Oxide Synthase Inhibitors with µ-Opioid Agonist Activity. ACS Med Chem Lett 3:227-231 (2012)  
Target
Name:
Nitric oxide synthase, endothelial
Synonyms:
Constitutive NOS Endothelial NOS NOS type III NOS3_HUMAN Nitric oxide synthase (inducible and endothelial) Nitric-oxide synthase (endothelial and brain) eNOS
Type:
Enzyme Catalytic Domain
Mol. Mass.:
133297.84
Organism:
Homo sapiens (Human)
Description:
P29474
Residue:
1203
  
Inhibitor
Name:
BDBM50386384
Synonyms:
CHEMBL2046874
Type:
Small organic molecule
Emp. Form.:
C28H33N5OS
Mol. Mass.:
487.66
SMILES:
CCOc1ccc(Cc2nc3cc(ccc3n2CCC2CCCN2C)N=C(N)c2cccs2)cc1
: