Target
Nitric oxide synthase, inducible
Ligand
BDBM50386382
Substrate
Meas. Tech.
ChEMBL_826806 (CHEMBL2051427)
IC50
55200±n/a nM
Citation
 Renton, PGreen, BMaddaford, SRakhit, SAndrews, JS NOpiates: Novel Dual Action Neuronal Nitric Oxide Synthase Inhibitors with µ-Opioid Agonist Activity. ACS Med Chem Lett 3:227-231 (2012)  
Target
Name:
Nitric oxide synthase, inducible
Synonyms:
HEP-NOS Inducible NO synthase NOS type II NOS2A Nitric oxide synthase, inducible (iNOS) | iNOS
Type:
Homodimer
Mol. Mass.:
131141.95
Organism:
Homo sapiens (Human)
Description:
P35228
Residue:
1153
  
Inhibitor
Name:
BDBM50386382
Synonyms:
CHEMBL2046872
Type:
Small organic molecule
Emp. Form.:
C27H33N5OS
Mol. Mass.:
475.649
SMILES:
CCOc1ccc(Cc2nc3cc(ccc3n2CCN(CC)CC)N=C(N)c2cccs2)cc1
: