Target
Serine/threonine-protein kinase pim-1
Ligand
BDBM50387295
Substrate
Meas. Tech.
ChEMBL_828048 (CHEMBL2049742)
IC50
20±n/a nM
Citation
 Dakin, LABlock, MHChen, HCode, EDowling, JEFeng, XFerguson, ADGreen, IHird, AWHoward, TKeeton, EKLamb, MLLyne, PDPollard, HRead, JWu, AJZhang, TZheng, X Discovery of novel benzylidene-1,3-thiazolidine-2,4-diones as potent and selective inhibitors of the PIM-1, PIM-2, and PIM-3 protein kinases. Bioorg Med Chem Lett 22:4599-604 (2012)  
Target
Name:
Serine/threonine-protein kinase pim-1
Synonyms:
PIM-1 Kinase PIM1_HUMAN Serine/threonine-protein kinase (PIM1) Serine/threonine-protein kinase PIM1 | Serine/threonine-protein kinase pim-1 (PIM1)
Type:
Protein
Mol. Mass.:
35681.82
Organism:
Homo sapiens (Human)
Description:
P11309
Residue:
313
  
Inhibitor
Name:
BDBM50387295
Synonyms:
CHEMBL2048868
Type:
Small organic molecule
Emp. Form.:
C16H19N3O3S
Mol. Mass.:
333.405
SMILES:
COc1cccc(C=C2SC(O)=NC2=O)c1N1CCC[C@@H](N)C1
: