Target
Calcitonin gene-related peptide type 1 receptor
Ligand
BDBM50387517
Substrate
Meas. Tech.
ChEMBL_830181 (CHEMBL2062031)
EC50
15±n/a nM
Citation
 Chaturvedula, PVPin, STholady, GConway, CMMacor, JEDubowchik, GM Design and synthesis of potent antagonists containing rigid spirocyclic privileged structures for the CGRP receptor. Bioorg Med Chem Lett 22:4719-22 (2012)  
Target
Name:
Calcitonin gene-related peptide type 1 receptor
Synonyms:
Adrenomedullin receptor AM1; CALCRL/RAMP2 CALRL_HUMAN CGRP type 1 receptor mRNA Calcitonin gene-related peptide (CGRP) receptor Calcitonin receptor-like receptor Human CL receptor
Type:
Enzyme Catalytic Domain
Mol. Mass.:
52980.45
Organism:
Homo sapiens (Human)
Description:
Q16602
Residue:
461
  
Inhibitor
Name:
BDBM50387517
Synonyms:
CHEMBL2059897
Type:
Small organic molecule
Emp. Form.:
C35H43N5O3S
Mol. Mass.:
613.813
SMILES:
O=C(N[C@H](Cc1csc2ccccc12)C(=O)N1CCC(CC1)N1CCCCC1)N1CCC2(CC1)NC(=O)Cc1ccccc21
: