Target
Natural resistance-associated macrophage protein 1
Ligand
BDBM50387739
Substrate
Meas. Tech.
ChEMBL_830680 (CHEMBL2061615)
IC50
>10000±n/a nM
Citation
 Zhang, ZKodumuru, VSviridov, SLiu, SChafeev, MChowdhury, SChakka, NSun, JGauthier, SJMattice, MRatkay, LGKwan, RThompson, JCutts, ABFu, JKamboj, RGoldberg, YPCadieux, JA Discovery of benzylisothioureas as potent divalent metal transporter 1 (DMT1) inhibitors. Bioorg Med Chem Lett 22:5108-13 (2012)  
Target
Name:
Natural resistance-associated macrophage protein 1
Synonyms:
LSH NRAMP NRAMP1 | SLC11A1
Type:
PROTEIN
Mol. Mass.:
59878.09
Organism:
Homo sapiens (Human)
Description:
ChEMBL_830680
Residue:
550
  
Inhibitor
Name:
BDBM50387739
Synonyms:
CHEMBL2058891
Type:
Small organic molecule
Emp. Form.:
C16H14Cl2N4OS2
Mol. Mass.:
413.345
SMILES:
NC(=N)SCc1c(Cl)ccc2c1oc1c(CSC(N)=N)c(Cl)ccc21
: