Target
Type-1 angiotensin II receptor
Ligand
BDBM82258
Substrate
Meas. Tech.
ChEMBL_830162 (CHEMBL2061972)
Kd
12.59±n/a nM
Citation
 Zhang, JWang, JLZhou, ZMLi, ZHXue, WZXu, DHao, LPHan, XFFei, FLiu, TLiang, AH Design, synthesis and biological activity of 6-substituted carbamoyl benzimidazoles as new nonpeptidic angiotensin II AT1 receptor antagonists. Bioorg Med Chem 20:4208-16 (2012)  
Target
Name:
Type-1 angiotensin II receptor
Synonyms:
AGTR1 ANGIOTENSIN AT1 Angiotensin II type 1a (AT-1a) receptor
Type:
Enzyme Catalytic Domain
Mol. Mass.:
41009.15
Organism:
RABBIT
Description:
ANGIOTENSIN AT1 AGTR1 RABBIT::P34976
Residue:
359
  
Inhibitor
Name:
BDBM82258
Synonyms:
CAS_114798-26-4 NSC_3961
Type:
Small organic molecule
Emp. Form.:
C22H23ClN6O
Mol. Mass.:
422.911
SMILES:
CCCCc1nc(Cl)c(CO)n1Cc1ccc(cc1)-c1ccccc1-c1nnn[nH]1
: