Target
Histone deacetylase 6
Ligand
BDBM19151
Substrate
Meas. Tech.
ChEMBL_831130 (CHEMBL2065943)
IC50
200±n/a nM
Citation
 Vickers, CJOlsen, CALeman, LJGhadiri, MR Discovery of HDAC Inhibitors That Lack an Active Site Zn(2+)-Binding Functional Group. ACS Med Chem Lett 3:505-508 (2012)  
Target
Name:
Histone deacetylase 6
Synonyms:
Cereblon/Histone deacetylase 6 HDAC6 Histone deacetylase 6 (HDAC6) KIAA0901 | ORF Names:JM21
Type:
Chromatin regulator; hydrolase; repressor
Mol. Mass.:
131381.51
Organism:
Homo sapiens (Human)
Description:
Q9UBN7
Residue:
1215
  
Inhibitor
Name:
BDBM19151
Synonyms:
(1S,4S,7Z,10S,16E,21R)-7-ethylidene-4,21-bis(propan-2-yl)-2-oxa-12,13-dithia-5,8,20,23-tetraazabicyclo[8.7.6]tricos-16-ene-3,6,9,19,22-pentone CHEMBL343448 FK228 | Romidepsin
Type:
Antibiotic
Emp. Form.:
C24H36N4O6S2
Mol. Mass.:
540.696
SMILES:
C\C=C1/NC(=O)[C@H]2CSSCC\C=C\[C@H](CC(=O)N[C@H](C(C)C)C(=O)N2)OC(=O)[C@@H](NC1=O)C(C)C
: