Target
Histone deacetylase 2
Ligand
BDBM19151
Substrate
Meas. Tech.
ChEMBL_831128 (CHEMBL2065941)
IC50
1±n/a nM
Citation
 Vickers, CJOlsen, CALeman, LJGhadiri, MR Discovery of HDAC Inhibitors That Lack an Active Site Zn(2+)-Binding Functional Group. ACS Med Chem Lett 3:505-508 (2012)  
Target
Name:
Histone deacetylase 2
Synonyms:
Cereblon/Histone deacetylase 2 HDAC2 Histone deacetylase 2 (HDAC2) | Human HDAC2
Type:
Chromatin regulator; hydrolase; repressor
Mol. Mass.:
55356.54
Organism:
Homo sapiens (Human)
Description:
Q92769
Residue:
488
  
Inhibitor
Name:
BDBM19151
Synonyms:
(1S,4S,7Z,10S,16E,21R)-7-ethylidene-4,21-bis(propan-2-yl)-2-oxa-12,13-dithia-5,8,20,23-tetraazabicyclo[8.7.6]tricos-16-ene-3,6,9,19,22-pentone CHEMBL343448 FK228 | Romidepsin
Type:
Antibiotic
Emp. Form.:
C24H36N4O6S2
Mol. Mass.:
540.696
SMILES:
C\C=C1/NC(=O)[C@H]2CSSCC\C=C\[C@H](CC(=O)N[C@H](C(C)C)C(=O)N2)OC(=O)[C@@H](NC1=O)C(C)C
: