Target
cGMP-inhibited 3',5'-cyclic phosphodiesterase 3A
Ligand
BDBM50390617
Substrate
Meas. Tech.
ChEMBL_835444 (CHEMBL2072150)
IC50
140±n/a nM
Citation
 Ochiai, KTakita, SKojima, AEiraku, TAndo, NIwase, KKishi, TOhinata, AYageta, YYasue, TAdams, DRKohno, Y Phosphodiesterase inhibitors. Part 4: design, synthesis and structure-activity relationships of dual PDE3/4-inhibitory fused bicyclic heteroaromatic-4,4-dimethylpyrazolones. Bioorg Med Chem Lett 22:5833-8 (2012)  
Target
Name:
cGMP-inhibited 3',5'-cyclic phosphodiesterase 3A
Synonyms:
3',5'-cyclic phosphodiesterase Cyclic GMP-inhibited phosphodiesterase A PDE3A_HUMAN Phosphodiesterase 3 (PDE3) Phosphodiesterase 3A Phosphodiesterase 3A (PDE3A1) cGMP-inhibited 3',5'-cyclic phosphodiesterase A | cGMP-inhibited 3,5-cyclic phosphodiesterase A
Type:
Enzyme
Mol. Mass.:
124966.46
Organism:
Homo sapiens (Human)
Description:
Q14432
Residue:
1141
  
Inhibitor
Name:
BDBM50390617
Synonyms:
CHEMBL2069609
Type:
Small organic molecule
Emp. Form.:
C14H13F3N4O2
Mol. Mass.:
326.2738
SMILES:
COc1ccc(C2=NNC(=O)C2(C)C)n2cc(nc12)C(F)(F)F
: