Target
Solute carrier family 22 member 7
Ligand
BDBM50335523
Substrate
Meas. Tech.
ChEMBL_835958 (CHEMBL2077096)
IC50
>5000000±n/a nM
Citation
 Khamdang, STakeda, MBabu, ENoshiro, ROnozato, MLTojo, AEnomoto, AHuang, XLNarikawa, SAnzai, NPiyachaturawat, PEndou, H Interaction of human and rat organic anion transporter 2 with various cephalosporin antibiotics. Eur J Pharmacol 465:1-7 (2003)  
Target
Name:
Solute carrier family 22 member 7
Synonyms:
Nlt Oat2 S22A7_RAT | Slc22a7
Type:
PROTEIN
Mol. Mass.:
58654.52
Organism:
Rattus norvegicus
Description:
ChEMBL_836967
Residue:
535
  
Inhibitor
Name:
BDBM50335523
Synonyms:
(6R,7R)-3-(acetoxymethyl)-7-(2-(2-aminothiazol-4-yl)-2-(methoxyimino)acetamido)-8-oxo-5-thia-1-aza-bicyclo[4.2.0]oct-2-ene-2-carboxylic acid (6R,7R)-3-Acetoxymethyl-7-{2-(2-amino-thiazol-4-yl)-2-[(E)-methoxyimino]-acetylamino}-8-oxo-5-thia-1-aza-bicyclo[4.2.0]oct-2-ene-2-carboxylic acid (6R,7R,E)-3-(acetoxymethyl)-7-(2-(2-aminothiazol-4-yl)-2-(methoxyimino)acetamido)-8-oxo-5-thia-1-aza-bicyclo[4.2.0]oct-2-ene-2-carboxylic acid (6R,7R,Z)-3-(acetoxymethyl)-7-(2-(5-aminothiophen-3-yl)-2-(methoxyimino)acetamido)-8-oxo-5-thia-1-aza-bicyclo[4.2.0]oct-2-ene-2-carboxylic acid (6S,7S,E)-3-(acetoxymethyl)-7-(2-(2-aminothiazol-4-yl)-2-(methoxyimino)acetamido)-8-oxo-5-thia-1-aza-bicyclo[4.2.0]oct-2-ene-2-carboxylic acid (R)-3-Acetoxymethyl-7-{2-(2-amino-thiazol-4-yl)-2-[(E)-methoxyimino]-acetylamino}-8-oxo-5-thia-1-aza-bicyclo[4.2.0]oct-2-ene-2-carboxylic acid 3-Acetoxymethyl-7-[2-(2-amino-thiazol-4-yl)-2-methoxyimino-acetylamino]-8-oxo-5-thia-1-aza-bicyclo[4.2.0]oct-2-ene-2-carboxylic acid 3-Acetoxymethyl-7-[2-(2-amino-thiazol-4-yl)-2-methoxyimino-acetylamino]-8-oxo-5-thia-1-aza-bicyclo[4.2.0]oct-2-ene-2-carboxylic acid anion 3-Acetoxymethyl-7-{2-(2-amino-thiazol-4-yl)-2-[(Z)-methoxyimino]-acetylamino}-8-oxo-5-thia-1-aza-bicyclo[4.2.0]oct-2-ene-2-carboxylic acid anion Cefotax Kefotex cefotaxime
Type:
Small organic molecule
Emp. Form.:
C16H17N5O7S2
Mol. Mass.:
455.465
SMILES:
CO\N=C(\C(=O)N[C@H]1[C@H]2SCC(COC(C)=O)=C(N2C1=O)C(O)=O)c1csc(N)n1
: