Target
Solute carrier family 15 member 1
Ligand
BDBM50139896
Substrate
Meas. Tech.
ChEMBL_838747 (CHEMBL2078573)
IC50
13700000±n/a nM
Citation
 Han, HKRhie, JKOh, DMSaito, GHsu, CPStewart, BHAmidon, GL CHO/hPEPT1 cells overexpressing the human peptide transporter (hPEPT1) as an alternative in vitro model for peptidomimetic drugs. J Pharm Sci 88:347-50 (1999)  
Target
Name:
Solute carrier family 15 member 1
Synonyms:
Intestinal H(+)/peptide cotransporter Oligopeptide transporter, small intestine isoform Peptide transporter 1 SLC15A1
Type:
PROTEIN
Mol. Mass.:
78818.07
Organism:
Homo sapiens (Human)
Description:
ChEMBL_1488839
Residue:
708
  
Inhibitor
Name:
BDBM50139896
Synonyms:
(6R,7R)-7-((R)-2-Amino-2-phenyl-acetylamino)-3-methyl-8-oxo-5-thia-1-aza-bicyclo[4.2.0]oct-2-ene-2-carboxylic acid CEPHALEXIN KEFLET KEFTAB
Type:
Small organic molecule
Emp. Form.:
C16H17N3O4S
Mol. Mass.:
347.389
SMILES:
CC1=C(N2[C@H](SC1)[C@H](NC(=O)[C@H](N)c1ccccc1)C2=O)C(O)=O
: