Target
Replicase polyprotein 1a
Ligand
BDBM51317
Substrate
Meas. Tech.
ChEMBL_848933 (CHEMBL2149727)
IC50
38700±n/a nM
Citation
 Park, JYKim, JHKim, YMJeong, HJKim, DWPark, KHKwon, HJPark, SJLee, WSRyu, YB Tanshinones as selective and slow-binding inhibitors for SARS-CoV cysteine proteases. Bioorg Med Chem 20:5928-35 (2012)  
Target
Name:
Replicase polyprotein 1a
Synonyms:
3C-like proteinase 3CLp Growth factor-like peptide Non-structural protein 1 Non-structural protein 11 Non-structural protein 3 Non-structural protein 6 Non-structural protein 8 ORF1a polyprotein PL2-PRO Papain-like proteinase Replicase polyprotein 1a SARS coronavirus 3C-like proteinase nsp1 nsp11 nsp3 nsp5 nsp7 nsp9 pp1a
Type:
Enzyme
Mol. Mass.:
486353.36
Organism:
Human SARS coronavirus (SARS-CoV)
Description:
P0C6U8
Residue:
4382
  
Inhibitor
Name:
BDBM51317
Synonyms:
1,6-dimethylnaphtho[1,2-g][1]benzofuran-10,11-dione 1,6-dimethylnaphtho[1,2-g]benzofuran-10,11-quinone SMR000445578 acs.jmedchem.1c00409_ST.675 | cid_114917
Type:
Small organic molecule
Emp. Form.:
C18H12O3
Mol. Mass.:
276.2861
SMILES:
Cc1coc-2c1C(=O)C(=O)c1c-2ccc2c(C)cccc12
: