Target
Aldo-keto reductase family 1 member B1
Ligand
BDBM50241487
Substrate
Meas. Tech.
ChEMBL_857754 (CHEMBL2168781)
IC50
34000±n/a nM
Citation
 Takemura, MEndo, SMatsunaga, TSoda, MZhao, HTEl-Kabbani, OTajima, KIinuma, MHara, A Selective inhibition of the tumor marker aldo-keto reductase family member 1B10 by oleanolic acid. J Nat Prod 74:1201-6 (2011)  
Target
Name:
Aldo-keto reductase family 1 member B1
Synonyms:
AKR1B1 ALDR_HUMAN AR Aldose Reductase (ALR2) Aldose reductase (AR)
Type:
Protein
Mol. Mass.:
35855.50
Organism:
Homo sapiens (Human)
Description:
P15121. 4LAU; 2IKI; 4LB4; 2FZD; 2FZ8; 1US0
Residue:
316
  
Inhibitor
Name:
BDBM50241487
Synonyms:
2,3,6,23-tetrahydroxyurs-12-en-28-oic acid CHEMBL404313 | asiantic acid
Type:
Small organic molecule
Emp. Form.:
C30H48O5
Mol. Mass.:
488.6991
SMILES:
C[C@@H]1CC[C@@]2(CC[C@]3(C)C(=CC[C@@H]4[C@@]5(C)C[C@@H](O)[C@H](O)[C@@](C)(CO)[C@@H]5CC[C@@]34C)[C@@H]2[C@H]1C)C(O)=O
: