Target
Endothelin receptor type B
Ligand
BDBM50395626
Substrate
Meas. Tech.
ChEMBL_859880 (CHEMBL2166381)
IC50
391±n/a nM
Citation
 Bolli, MHBoss, CBinkert, CBuchmann, SBur, DHess, PIglarz, MMeyer, SRein, JRey, MTreiber, AClozel, MFischli, WWeller, T The discovery of N-[5-(4-bromophenyl)-6-[2-[(5-bromo-2-pyrimidinyl)oxy]ethoxy]-4-pyrimidinyl]-N'-propylsulfamide (Macitentan), an orally active, potent dual endothelin receptor antagonist. J Med Chem 55:7849-61 (2012)  
Target
Name:
Endothelin receptor type B
Synonyms:
EDNRB ENDOTHELIN B ETRB Endothelin receptor non-selective type | Endothelin receptor, ET-A/ET-B
Type:
Enzyme Catalytic Domain
Mol. Mass.:
49664.00
Organism:
Homo sapiens (Human)
Description:
ENDOTHELIN B EDNRB HUMAN::P24530
Residue:
442
  
Inhibitor
Name:
BDBM50395626
Synonyms:
ACT-064992 | MACITENTAN
Type:
Small organic molecule
Emp. Form.:
C19H20Br2N6O4S
Mol. Mass.:
588.273
SMILES:
CCCNS(=O)(=O)Nc1ncnc(OCCOc2ncc(Br)cn2)c1-c1ccc(Br)cc1
: