Target
Indoleamine 2,3-dioxygenase 2
Ligand
BDBM31772
Substrate
Meas. Tech.
ChEMBL_885588 (CHEMBL2210857)
IC50
6700±n/a nM
Citation
 Bakmiwewa, SMFatokun, AATran, APayne, RJHunt, NHBall, HJ Identification of selective inhibitors of indoleamine 2,3-dioxygenase 2. Bioorg Med Chem Lett 22:7641-6 (2012)  
Target
Name:
Indoleamine 2,3-dioxygenase 2
Synonyms:
I23O2_MOUSE Ido2 Indoleamine 2,3-dioxygenase-like protein 1 | Indoleamine-pyrrole 2,3-dioxygenase-like protein 1
Type:
PROTEIN
Mol. Mass.:
45256.34
Organism:
Mus musculus
Description:
ChEMBL_105489
Residue:
405
  
Inhibitor
Name:
BDBM31772
Synonyms:
1-[2-(2,4-dichlorobenzyl)oxy-2-(2,4-dichlorophenyl)ethyl]imidazole;nitric acid CHEMBL91 Miconazole US9144538, Miconazole Nitrate | cid_4189
Type:
Small organic molecule
Emp. Form.:
C18H14Cl4N2O
Mol. Mass.:
416.129
SMILES:
Clc1ccc(COC(Cn2ccnc2)c2ccc(Cl)cc2Cl)c(Cl)c1
: