Target
Carnitine O-palmitoyltransferase 1, muscle isoform
Ligand
BDBM50403028
Substrate
Meas. Tech.
ChEMBL_887375 (CHEMBL2216984)
IC50
360±n/a nM
Citation
 Ceccarelli, SMChomienne, OGubler, MArduini, A Carnitine palmitoyltransferase (CPT) modulators: a medicinal chemistry perspective on 35 years of research. J Med Chem 54:3109-52 (2011)  
Target
Name:
Carnitine O-palmitoyltransferase 1, muscle isoform
Synonyms:
CPT I CPT1B CPTI-M Carnitine palmitoyltransferase I-like protein | KIAA1670
Type:
PROTEIN
Mol. Mass.:
87823.36
Organism:
Homo sapiens (Human)
Description:
ChEMBL_887440
Residue:
772
  
Inhibitor
Name:
BDBM50403028
Synonyms:
CHEMBL2216769
Type:
Small organic molecule
Emp. Form.:
C35H58N7O20P3S
Mol. Mass.:
1021.856
SMILES:
CCCCCCCC[C@H]1OC(=O)C(CSCCNC(=O)CCNC(=O)[C@H](O)C(C)(C)COP(O)(=O)OP(O)(=O)OC[C@H]2O[C@H]([C@H](O)[C@@H]2OP(O)(O)=O)n2cnc3c(N)cnnc23)[C@@H]1C(O)=O
: