Target
5-hydroxytryptamine receptor 6
Ligand
BDBM50403826
Substrate
Meas. Tech.
ChEBML_3647
Ki
1±n/a nM
Citation
 Bromidge, SMClarke, SEGager, TGriffith, KJeffrey, PJennings, AJJoiner, GFKing, FDLovell, PJMoss, SFNewman, HRiley, GRogers, DRoutledge, CSerafinowska, HSmith, DR Phenyl benzenesulfonamides are novel and selective 5-HT6 antagonists: identification of N-(2,5-dibromo-3-fluorophenyl)-4-methoxy-3-piperazin-1-ylbenzenesulfonamide (SB-357134). Bioorg Med Chem Lett 11:55-8 (2001)  
Target
Name:
5-hydroxytryptamine receptor 6
Synonyms:
5-HT-6 5-hydroxytryptamine receptor 6 (5-HT-6) 5-hydroxytryptamine receptor 6 (5HT6) HTR6 Serotonin 6 (5-HT6) receptor | Serotonin Receptor 6
Type:
G Protein-Coupled Receptor (GPCR)
Mol. Mass.:
46968.43
Organism:
Homo sapiens (Human)
Description:
P50406
Residue:
440
  
Inhibitor
Name:
BDBM50403826
Synonyms:
CHEMBL154274
Type:
Small organic molecule
Emp. Form.:
C17H19Br2N3O3S
Mol. Mass.:
505.224
SMILES:
COc1ccc(cc1N1CCNCC1)S(=O)(=O)Nc1cc(Br)ccc1Br
: