Target
Neutrophil elastase
Ligand
BDBM50406280
Substrate
Meas. Tech.
ChEMBL_21101 (CHEMBL633695)
Ki
6.31E3±n/a nM
KOFF
9.772E-4 s-1
KON
1.514E2 M-1s-1
Citation
 Krantz, ASpencer, RWTam, TFLiak, TJCopp, LJThomas, EMRafferty, SP Design and synthesis of 4H-3,1-benzoxazin-4-ones as potent alternate substrate inhibitors of human leukocyte elastase. J Med Chem 33:464-79 (1990)  
Target
Name:
Neutrophil elastase
Synonyms:
Bone marrow serine protease Coagulation factor X ELANE Elastase HLE Leukocyte elastase Medullasin Neutrophil elastase (HNE) PMN elastase Trypsin
Type:
Enzyme
Mol. Mass.:
28532.38
Organism:
Homo sapiens (Human)
Description:
P08246
Residue:
267
  
Inhibitor
Name:
BDBM50406280
Synonyms:
CHEMBL142397
Type:
Small organic molecule
Emp. Form.:
C16H22N2O2
Mol. Mass.:
274.3581
SMILES:
CC(C)CN(CC(C)C)c1nc2ccccc2c(=O)o1
: