Target
Neutrophil elastase
Ligand
BDBM50406244
Substrate
Meas. Tech.
ChEMBL_21101 (CHEMBL633695)
Ki
2.512E2±n/a nM
KOFF
1.82E-5 s-1
KON
7.586E1 M-1s-1
Citation
 Krantz, ASpencer, RWTam, TFLiak, TJCopp, LJThomas, EMRafferty, SP Design and synthesis of 4H-3,1-benzoxazin-4-ones as potent alternate substrate inhibitors of human leukocyte elastase. J Med Chem 33:464-79 (1990)  
Target
Name:
Neutrophil elastase
Synonyms:
Bone marrow serine protease Coagulation factor X ELANE Elastase HLE Leukocyte elastase Medullasin Neutrophil elastase (HNE) PMN elastase Trypsin
Type:
Enzyme
Mol. Mass.:
28532.38
Organism:
Homo sapiens (Human)
Description:
P08246
Residue:
267
  
Inhibitor
Name:
BDBM50406244
Synonyms:
CHEMBL444082
Type:
Small organic molecule
Emp. Form.:
C14H18N2O2
Mol. Mass.:
246.3049
SMILES:
Cc1cccc2nc(NCC(C)(C)C)oc(=O)c12
: