Target
Vascular endothelial growth factor receptor 2
Ligand
BDBM50065293
Substrate
Meas. Tech.
ChEMBL_213948 (CHEMBL811926)
IC50
1000000±n/a nM
Citation
 Vieth, MCummins, DJ DoMCoSAR: a novel approach for establishing the docking mode that is consistent with the structure-activity relationship. Application to HIV-1 protease inhibitors and VEGF receptor tyrosine kinase inhibitors. J Med Chem 43:3020-32 (2000)  
Target
Name:
Vascular endothelial growth factor receptor 2
Synonyms:
Flk-1 Kdr VGFR2_MOUSE | Vascular endothelial growth factor receptor 2
Type:
PROTEIN
Mol. Mass.:
152506.58
Organism:
Mus musculus
Description:
ChEMBL_1469997
Residue:
1367
  
Inhibitor
Name:
BDBM50065293
Synonyms:
3-[1-(4-Piperidin-1-yl-phenyl)-eth-(E)-ylidene]-1,3-dihydro-indol-2-one CHEMBL314798
Type:
Small organic molecule
Emp. Form.:
C21H22N2O
Mol. Mass.:
318.4122
SMILES:
C\C(=C1/C(=O)Nc2ccccc12)c1ccc(cc1)N1CCCCC1
: