Target
Angiotensin-converting enzyme
Ligand
BDBM50411736
Substrate
Meas. Tech.
ChEMBL_465245 (CHEMBL933039)
Ki
3.2±n/a nM
Citation
 Deaton, DNGao, ENGraham, KPGross, JWMiller, ABStrelow, JM Thiol-based angiotensin-converting enzyme 2 inhibitors: P1 modifications for the exploration of the S1 subsite. Bioorg Med Chem Lett 18:732-7 (2008)  
Target
Name:
Angiotensin-converting enzyme
Synonyms:
ACE Angiotensin converting enzyme (ACE) Angiotensin-converting enzyme, soluble form CD_antigen=CD143 DCP1 Kininase II
Type:
Enzyme
Mol. Mass.:
149709.01
Organism:
Homo sapiens (Human)
Description:
Residue:
1306
  
Inhibitor
Name:
BDBM50411736
Synonyms:
CHEMBL271225
Type:
Small organic molecule
Emp. Form.:
C21H25NO3S
Mol. Mass.:
371.493
SMILES:
CC(C)C[C@H](S)C(=O)N[C@@H](Cc1ccc(cc1)-c1ccccc1)C(O)=O
: