Target
Angiotensin-converting enzyme
Ligand
BDBM50286715
Substrate
Meas. Tech.
ChEMBL_465245 (CHEMBL933039)
Ki
30±n/a nM
Citation
 Deaton, DNGao, ENGraham, KPGross, JWMiller, ABStrelow, JM Thiol-based angiotensin-converting enzyme 2 inhibitors: P1 modifications for the exploration of the S1 subsite. Bioorg Med Chem Lett 18:732-7 (2008)  
Target
Name:
Angiotensin-converting enzyme
Synonyms:
ACE Angiotensin converting enzyme (ACE) Angiotensin-converting enzyme, soluble form CD_antigen=CD143 DCP1 Kininase II
Type:
Enzyme
Mol. Mass.:
149709.01
Organism:
Homo sapiens (Human)
Description:
Residue:
1306
  
Inhibitor
Name:
BDBM50286715
Synonyms:
(S)-3-biphenyl-4-yl-2-((S)-2-mercapto-3-phenyl-propionylamino)-propionic acid | CHEMBL350414
Type:
Small organic molecule
Emp. Form.:
C24H23NO3S
Mol. Mass.:
405.509
SMILES:
OC(=O)[C@H](Cc1ccc(cc1)-c1ccccc1)NC(=O)[C@@H](S)Cc1ccccc1
: