Target
Alpha-2A adrenergic receptor
Ligand
BDBM50019492
Substrate
Meas. Tech.
ChEMBL_487917 (CHEMBL1015736)
Ki
0.363078±n/a nM
Citation
 Gentili, FCardinaletti, CVesprini, CCarrieri, AGhelfi, FFarande, AGiannella, MPiergentili, AQuaglia, WLaurila, JMHuhtinen, AScheinin, MPigini, M Alpha2-adrenoreceptors profile modulation. 4. From antagonist to agonist behavior. J Med Chem 51:4289-99 (2008)  
Target
Name:
Alpha-2A adrenergic receptor
Synonyms:
ADA2A_HUMAN ADRA2R Adrenergic alpha2A Alpha-2 adrenergic receptor subtype C10 Alpha-2A adrenoreceptor alpha-2A adrenergic receptor [Homo sapiens]
Type:
Enzyme
Mol. Mass.:
48979.91
Organism:
Homo sapiens (Human)
Description:
P08913
Residue:
465
  
Inhibitor
Name:
BDBM50019492
Synonyms:
(+)2-(2-Methoxy-2,3-dihydro-benzo[1,4]dioxin-2-yl)-4,5-dihydro-1H-imidazole 2-(2,3-dihydro-2-methoxy-1,4-benzodioxin-2-yl)-4,5-dihydro-1H-imidazole 2-(2-methoxy-2,3-dihydrobenzo[b][1,4]dioxin-2-yl)-4,5-dihydro-1H-imidazole CHEMBL10332 RX821002
Type:
Small organic molecule
Emp. Form.:
C12H14N2O3
Mol. Mass.:
234.2512
SMILES:
COC1(COc2ccccc2O1)C1=NCCN1
: