Target
Beta-2 adrenergic receptor
Ligand
BDBM86453
Substrate
Meas. Tech.
ChEMBL_562921 (CHEMBL1019681)
EC50
0.501187±n/a nM
Citation
 Procopiou, PABarrett, VJBevan, NJBiggadike, KButchers, PRCoe, DMConroy, REdney, DDField, RNFord, AJGuntrip, SBLooker, BEMcLay, IMMonteith, MJMorrison, VSMutch, PJRichards, SASasse, RSmith, CE Synthesis and structure-activity relationships of long-acting beta2 adrenergic receptor agonists incorporating arylsulfonamide groups. J Med Chem 52:2280-8 (2009)  
Target
Name:
Beta-2 adrenergic receptor
Synonyms:
ADRB2 ADRB2_HUMAN Beta-2 adrenoceptor | Beta-2 adrenoreceptor
Type:
Mol. Mass.:
46461.69
Organism:
Homo sapiens (Human)
Description:
P07550
Residue:
413
  
Inhibitor
Name:
BDBM86453
Synonyms:
CAS_73573-87-2 NSC_3083544
Type:
Small organic molecule
Emp. Form.:
C19H24N2O4
Mol. Mass.:
344.4049
SMILES:
COc1ccc(CC(C)NCC(O)c2ccc(O)c(NC=O)c2)cc1
: