Target
Cytochrome P450 2A6
Ligand
BDBM50159263
Substrate
Meas. Tech.
ChEMBL_572015 (CHEMBL1023677)
IC50
16982±n/a nM
Citation
 Roy, KRoy, PP Exploring QSAR and QAAR for inhibitors of cytochrome P450 2A6 and 2A5 enzymes using GFA and G/PLS techniques. Eur J Med Chem 44:1941-51 (2009)  
Target
Name:
Cytochrome P450 2A6
Synonyms:
1,4-cineole 2-exo-monooxygenase CP2A6_HUMAN CYP2A6 Coumarin 7-hydroxylase Cytochrome P450 IIA3 | Cytochrome P450(I)
Type:
Protein
Mol. Mass.:
56514.34
Organism:
Homo sapiens (Human)
Description:
P11509
Residue:
494
  
Inhibitor
Name:
BDBM50159263
Synonyms:
1,4-dichlorobenzene PARA Paradichlorbenzol p-chlorophenyl chloride | paradichlorobenzene
Type:
Small organic molecule
Emp. Form.:
C6H4Cl2
Mol. Mass.:
147.002
SMILES:
Clc1ccc(Cl)cc1
: