Target
Neuropeptide FF receptor 1
Ligand
BDBM50414850
Substrate
Meas. Tech.
ChEMBL_590511 (CHEMBL1058558)
EC50
794.33±n/a nM
Citation
 Gaubert, GBertozzi, FKelly, NMPawlas, JScully, ALNash, NRGardell, LRLameh, JOlsson, R Discovery of selective nonpeptidergic neuropeptide FF2 receptor agonists. J Med Chem 52:6511-4 (2009)  
Target
Name:
Neuropeptide FF receptor 1
Synonyms:
G-protein coupled receptor 147 NPFF1 NPFFR1 | RFamide-related peptide receptor OT7T022
Type:
PROTEIN
Mol. Mass.:
47840.07
Organism:
Homo sapiens (Human)
Description:
ChEMBL_1474637
Residue:
430
  
Inhibitor
Name:
BDBM50414850
Synonyms:
CHEMBL575058
Type:
Small organic molecule
Emp. Form.:
C14H12Cl2N4
Mol. Mass.:
307.178
SMILES:
[#7]\[#6](-[#7])=[#7]\[#7]=[#6](-c1ccccc1)-c1ccc(Cl)c(Cl)c1
: