Target
Potassium voltage-gated channel subfamily H member 2
Ligand
BDBM50414959
Substrate
Meas. Tech.
ChEMBL_594036 (CHEMBL1045843)
IC50
87.1±n/a nM
Citation
 Shamovsky, Ide Graaf, CAlderin, LBengtsson, MBladh, HBörjesson, LConnolly, SDyke, HJvan den Heuvel, MJohansson, HJosefsson, BGKristoffersson, ALinnanen, TLisius, AMännikkö, RNordén, BPrice, SRipa, LRognan, DRosendahl, ASkrinjar, MUrbahns, K Increasing selectivity of CC chemokine receptor 8 antagonists by engineering nondesolvation related interactions with the intended and off-target binding sites. J Med Chem 52:7706-23 (2009)  
Target
Name:
Potassium voltage-gated channel subfamily H member 2
Synonyms:
1,3-beta-glucan synthase component GLS2 ERG Eag-related protein 1 Ether-a-go-go-related gene (HERG) Ether-a-go-go-related gene potassium channel 1 Ether-a-go-go-related gene potassium channel 1 (hERG1) Ether-a-go-go-related protein 1 H-ERG KCNH2 Potassium voltage-gated channel subfamily H member 2 (hERG) Voltage-gated potassium channel subunit Kv11.1 hERG Potassium Channel 1 | putative potassium channel subunit
Type:
Multi-pass membrane protein
Mol. Mass.:
126672.65
Organism:
Homo sapiens (Human)
Description:
Q12809
Residue:
1159
  
Inhibitor
Name:
BDBM50414959
Synonyms:
CHEMBL409224
Type:
Small organic molecule
Emp. Form.:
C30H33ClN2O3
Mol. Mass.:
505.048
SMILES:
COc1ccccc1Oc1ccccc1CN1CCC2(CC1)CCN(CC2)C(=O)c1ccc(Cl)cc1
: