Target
Carbonic anhydrase 2
Ligand
BDBM50415863
Substrate
Meas. Tech.
ChEMBL_632192 (CHEMBL1106525)
Ki
9090000±n/a nM
Citation
 Sethi, KKVerma, SMPrasanthi, NSahoo, SKParhi, RNSuresh, P 3D-QSAR study of benzene sulfonamide analogs as carbonic anhydrase II inhibitors. Bioorg Med Chem Lett 20:3089-93 (2010)  
Target
Name:
Carbonic anhydrase 2
Synonyms:
CA-II CAC Carbonate dehydratase II Carbonic anhydrase 2 (CA-II) Carbonic anhydrase C Carbonic anhydrase II (CA-II) Carbonic anhydrase II (hCA II) | Carbonic anhydrase isoenzyme II (hCA II)
Type:
Enzyme
Mol. Mass.:
29250.71
Organism:
Homo sapiens (Human)
Description:
P00918
Residue:
260
  
Inhibitor
Name:
BDBM50415863
Synonyms:
CHEMBL358263
Type:
Small organic molecule
Emp. Form.:
C8H11NO2S
Mol. Mass.:
185.243
SMILES:
CCc1ccc(cc1)S(N)(=O)=O
: