Target
Extracellular calcium-sensing receptor
Ligand
BDBM50416875
Substrate
Meas. Tech.
ChEMBL_664261 (CHEMBL1261768)
EC50
19.95±n/a nM
Citation
 Gustafsson, MJensen, JBertozzi, SMCurrier, EAMa, JNBurstein, ESOlsson, R Discovery of a class of calcium sensing receptor positive allosteric modulators; 1-(benzothiazol-2-yl)-1-phenylethanols. Bioorg Med Chem Lett 20:5918-21 (2010)  
Target
Name:
Extracellular calcium-sensing receptor
Synonyms:
CASR CaR Calcium-sensing receptor (CaSR) GPRC2A Parathyroid Cell calcium-sensing receptor Synonyms=GPRC2A | hCasR
Type:
Protein
Mol. Mass.:
120663.13
Organism:
Homo sapiens (Human)
Description:
P41180
Residue:
1078
  
Inhibitor
Name:
BDBM50416875
Synonyms:
AMG-073 CINACALCET US9487494, Cinacalcet
Type:
Small organic molecule
Emp. Form.:
C22H22F3N
Mol. Mass.:
357.412
SMILES:
C[C@@H](NCCCc1cccc(c1)C(F)(F)F)c1cccc2ccccc12
: