Target
Beta-1 adrenergic receptor
Ligand
BDBM50419682
Substrate
Meas. Tech.
ChEMBL_800670 (CHEMBL1947792)
IC50
10±n/a nM
Citation
 Alcaraz, LBailey, ACadogan, EConnolly, SJewell, RJordan, SKindon, NLister, ALawson, MMullen, ADainty, INicholls, DPaine, SPairaudeau, GStocks, MJThorne, PYoung, A From libraries to candidate: the discovery of new ultra long-acting dibasicß2-adrenoceptor agonists. Bioorg Med Chem Lett 22:689-95 (2011)  
Target
Name:
Beta-1 adrenergic receptor
Synonyms:
ADRB1 ADRB1_HUMAN Beta-1 adrenoceptor | adrenergic Beta1
Type:
G Protein-Coupled Receptor (GPCR)
Mol. Mass.:
51338.40
Organism:
Homo sapiens (Human)
Description:
P08588
Residue:
477
  
Inhibitor
Name:
BDBM50419682
Synonyms:
CHEMBL1945041
Type:
Small organic molecule
Emp. Form.:
C25H26ClN3O3S
Mol. Mass.:
484.01
SMILES:
O[C@@H](CNCCc1cccc(CNCc2ccccc2Cl)c1)c1ccc(O)c2[nH]c(=O)sc12
: