Target
Alpha-2C adrenergic receptor
Ligand
BDBM50419884
Substrate
Meas. Tech.
ChEMBL_805963 (CHEMBL1960291)
EC50
28±n/a nM
Citation
 Diamanti, EDel Bello, FCarbonara, GCarrieri, AFracchiolla, GGiannella, MMammoli, VPiergentili, APohjanoksa, KQuaglia, WScheinin, MPigini, M Might the observeda(2A)-adrenoreceptor agonism or antagonism of allyphenyline analogues be ascribed to different molecular conformations? Bioorg Med Chem 20:2082-90 (2012)  
Target
Name:
Alpha-2C adrenergic receptor
Synonyms:
ADA2C_HUMAN ADRA2L2 Adrenergic alpha2C Adrenergic receptor alpha Alpha-2 adrenergic receptor subtype C4 Alpha-2C adrenoreceptor | adrenergic, alpha-2C-, receptor [Homo sapiens]
Type:
Enzyme
Mol. Mass.:
49552.32
Organism:
Homo sapiens (Human)
Description:
P18825
Residue:
462
  
Inhibitor
Name:
BDBM50419884
Synonyms:
CHEMBL157955
Type:
Small organic molecule
Emp. Form.:
C15H22N2O
Mol. Mass.:
246.348
SMILES:
CCc1cccc(CC)c1OC(C)C1=NCCN1
: