Target
Solute carrier family 22 member 11
Ligand
BDBM50344964
Substrate
Meas. Tech.
ChEMBL_836434 (CHEMBL2076874)
Ki
502000±n/a nM
Citation
 Enomoto, ATakeda, MShimoda, MNarikawa, SKobayashi, YKobayashi, YYamamoto, TSekine, TCha, SHNiwa, TEndou, H Interaction of human organic anion transporters 2 and 4 with organic anion transport inhibitors. J Pharmacol Exp Ther 301:797-802 (2002)  
Target
Name:
Solute carrier family 22 member 11
Synonyms:
OAT4 S22AB_HUMAN | SLC22A11
Type:
PROTEIN
Mol. Mass.:
59982.54
Organism:
Homo sapiens (Human)
Description:
ChEMBL_838708
Residue:
550
  
Inhibitor
Name:
BDBM50344964
Synonyms:
Betamipron N-(phenylcarbonyl)-beta-alanine
Type:
Small organic molecule
Emp. Form.:
C10H11NO3
Mol. Mass.:
193.1992
SMILES:
OC(=O)CCNC(=O)c1ccccc1
: