Target
Solute carrier family 22 member 6
Ligand
BDBM50074922
Substrate
Meas. Tech.
ChEMBL_838299 (CHEMBL2076247)
IC50
1500±n/a nM
Citation
 Mulato, ASHo, ESCihlar, T Nonsteroidal anti-inflammatory drugs efficiently reduce the transport and cytotoxicity of adefovir mediated by the human renal organic anion transporter 1. J Pharmacol Exp Ther 295:10-5 (2000) Target
Name:
Solute carrier family 22 member 6
Synonyms:
OAT1 PAH transporter Renal organic anion transporter 1 SLC22A6 hPAHT | hROAT1
Type:
PROTEIN
Mol. Mass.:
61831.78
Organism:
Homo sapiens (Human)
Description:
ChEMBL_1487359
Residue:
563
  
Inhibitor
Name:
BDBM50074922
Synonyms:
(+-)-2-fluoro-alpha-methyl-4-biphenylacetic acid 2-(2-fluorobiphenyl-4-yl)propanoic acid 3-fluoro-4-phenylhydratropic acid CHEMBL563 US9630914, Compound A
Type:
Small organic molecule
Emp. Form.:
C15H13FO2
Mol. Mass.:
244.2609
SMILES:
CC(C(O)=O)c1ccc(c(F)c1)-c1ccccc1
: