Target
Solute carrier organic anion transporter family member 1A3
Ligand
BDBM50367343
Substrate
Meas. Tech.
ChEMBL_838743 (CHEMBL2078569)
Ki
14100±n/a nM
Citation
 Takeuchi, AMasuda, SSaito, HHashimoto, YInui, K Trans-stimulation effects of folic acid derivatives on methotrexate transport by rat renal organic anion transporter, OAT-K1. J Pharmacol Exp Ther 293:1034-9 (2000) Target
Name:
Solute carrier organic anion transporter family member 1A3
Synonyms:
OAT-K1 Oatp1a3 Slc21a4 Sodium-independent organic anion transporter K1 rOAT-K
Type:
PROTEIN
Mol. Mass.:
73829.31
Organism:
Rattus norvegicus
Description:
ChEMBL_838743
Residue:
670
  
Inhibitor
Name:
BDBM50367343
Synonyms:
(2S)-2-[[4-[(2-amino-4-oxo-1H-pteridin-6-yl)methylamino]benzoyl]amino]pentanedioic acid Folacin Vitamin B9 | Vitamin M
Type:
Small organic molecule
Emp. Form.:
C19H19N7O6
Mol. Mass.:
441.3975
SMILES:
Nc1nc2ncc(CNc3ccc(cc3)C(=O)N[C@@H](CCC(O)=O)C(O)=O)nc2c(=O)[nH]1
: