Target
Bile salt export pump
Ligand
BDBM50391000
Substrate
Meas. Tech.
ChEMBL_836284 (CHEMBL2076297)
Ki
3800±n/a nM
Citation
 Stieger, BFattinger, KMadon, JKullak-Ublick, GAMeier, PJ Drug- and estrogen-induced cholestasis through inhibition of the hepatocellular bile salt export pump (Bsep) of rat liver. Gastroenterology 118:422-30 (2000)  
Target
Name:
Bile salt export pump
Synonyms:
ABCBB_RAT Abcb11 Bile salt export pump Sister of P-glycoprotein | Spgp
Type:
PROTEIN
Mol. Mass.:
146267.86
Organism:
Rattus norvegicus
Description:
ChEMBL_1481883
Residue:
1321
  
Inhibitor
Name:
BDBM50391000
Synonyms:
CB-01-11 | RIFAMYCIN
Type:
Small organic molecule
Emp. Form.:
C37H47NO12
Mol. Mass.:
697.7686
SMILES:
CO[C@H]1\C=C\O[C@@]2(C)Oc3c(C2=O)c2c(O)cc(NC(=O)\C(C)=C/C=C/[C@H](C)[C@H](O)[C@@H](C)[C@@H](O)[C@@H](C)[C@H](OC(C)=O)[C@@H]1C)c(O)c2c(O)c3C
: