Target
Solute carrier family 22 member 1
Ligand
BDBM50026220
Substrate
Meas. Tech.
ChEMBL_836965 (CHEMBL2075805)
IC50
398000±n/a nM
Citation
 Okuda, MUrakami, YSaito, HInui, K Molecular mechanisms of organic cation transport in OCT2-expressing Xenopus oocytes. Biochim Biophys Acta 1417:224-31 (1999)  
Target
Name:
Solute carrier family 22 member 1
Synonyms:
Adrenaline alpha1 Organic cation transporter 1 Slc22a1 adrenergic Alpha1 | rOCT1
Type:
Enzyme Catalytic Domain
Mol. Mass.:
61538.40
Organism:
RAT
Description:
Adrenaline alpha1 0 RAT::Q63089
Residue:
556
  
Inhibitor
Name:
BDBM50026220
Synonyms:
2-hydroxy-N,N,N-trimethylethanaminium CHEMBL293410 N-trimethylethanolamine choline | trimethylethanolamine
Type:
Small organic molecule
Emp. Form.:
C5H14NO
Mol. Mass.:
104.1702
SMILES:
C[N+](C)(C)CCO
: