Target
Solute carrier family 22 member 6
Ligand
BDBM50344964
Substrate
Meas. Tech.
ChEMBL_836138 (CHEMBL2077574)
Ki
23600±n/a nM
Citation
 Takeda, MNarikawa, SHosoyamada, MCha, SHSekine, TEndou, H Characterization of organic anion transport inhibitors using cells stably expressing human organic anion transporters. Eur J Pharmacol 419:113-20 (2001)  
Target
Name:
Solute carrier family 22 member 6
Synonyms:
OAT1 PAH transporter Renal organic anion transporter 1 SLC22A6 hPAHT | hROAT1
Type:
PROTEIN
Mol. Mass.:
61831.78
Organism:
Homo sapiens (Human)
Description:
ChEMBL_1487359
Residue:
563
  
Inhibitor
Name:
BDBM50344964
Synonyms:
Betamipron N-(phenylcarbonyl)-beta-alanine
Type:
Small organic molecule
Emp. Form.:
C10H11NO3
Mol. Mass.:
193.1992
SMILES:
OC(=O)CCNC(=O)c1ccccc1
: