Target
Solute carrier family 15 member 2
Ligand
BDBM50370586
Substrate
Meas. Tech.
ChEMBL_838253 (CHEMBL2076201)
Ki
280000±n/a nM
Citation
 Luckner, PBrandsch, M Interaction of 31 beta-lactam antibiotics with the H+/peptide symporter PEPT2: analysis of affinity constants and comparison with PEPT1. Eur J Pharm Biopharm 59:17-24 (2004)  
Target
Name:
Solute carrier family 15 member 2
Synonyms:
Oligopeptide transporter, kidney isoform S15A2_RAT | Slc15a2
Type:
PROTEIN
Mol. Mass.:
81331.63
Organism:
Rattus norvegicus
Description:
ChEMBL_838253
Residue:
729
  
Inhibitor
Name:
BDBM50370586
Synonyms:
7-(2-(2-amino-4-thiazolyl)-4-carboxy-2-butenoylamino)-3-cephem-4-carboxylic acid CEFTIBUTEN Cedex | SCH-39720
Type:
Small organic molecule
Emp. Form.:
C15H14N4O6S2
Mol. Mass.:
410.425
SMILES:
Nc1nc(cs1)C(=C\CC(O)=O)\C(=O)N[C@H]1[C@H]2SCC=C(N2C1=O)C(O)=O
: