Target
Solute carrier family 15 member 2
Ligand
BDBM50420259
Substrate
Meas. Tech.
ChEMBL_838253 (CHEMBL2076201)
Ki
>10000000±n/a nM
Citation
 Luckner, PBrandsch, M Interaction of 31 beta-lactam antibiotics with the H+/peptide symporter PEPT2: analysis of affinity constants and comparison with PEPT1. Eur J Pharm Biopharm 59:17-24 (2004)  
Target
Name:
Solute carrier family 15 member 2
Synonyms:
Oligopeptide transporter, kidney isoform S15A2_RAT | Slc15a2
Type:
PROTEIN
Mol. Mass.:
81331.63
Organism:
Rattus norvegicus
Description:
ChEMBL_838253
Residue:
729
  
Inhibitor
Name:
BDBM50420259
Synonyms:
CEFTAZIDIME
Type:
Small organic molecule
Emp. Form.:
C22H22N6O7S2
Mol. Mass.:
546.576
SMILES:
CC(C)(O\N=C(/C(=O)N[C@H]1[C@H]2SCC(C[n+]3ccccc3)=C(N2C1=O)C([O-])=O)c1csc(N)n1)C(O)=O
: