Target
Sex hormone-binding globulin
Ligand
BDBM50423497
Substrate
Meas. Tech.
ChEMBL_466706 (CHEMBL922711)
Kd
2188±n/a nM
Citation
 Cherkasov, ABan, FSantos-Filho, OThorsteinson, NFallahi, MHammond, GL An updated steroid benchmark set and its application in the discovery of novel nanomolar ligands of sex hormone-binding globulin. J Med Chem 51:2047-56 (2008)  
Target
Name:
Sex hormone-binding globulin
Synonyms:
SHBG Testis-specific androgen-binding protein
Type:
PROTEIN
Mol. Mass.:
43780.19
Organism:
Homo sapiens (Human)
Description:
ChEMBL_466706
Residue:
402
  
Inhibitor
Name:
BDBM50423497
Synonyms:
CHEMBL265939 | ZINC 00457465[36]
Type:
Small organic molecule
Emp. Form.:
C15H13ClO3
Mol. Mass.:
276.715
SMILES:
Cc1c(O)ccc(C(=O)Cc2ccccc2Cl)c1O
: