Target
Sex hormone-binding globulin
Ligand
BDBM50423514
Substrate
Meas. Tech.
ChEMBL_466706 (CHEMBL922711)
Kd
12±n/a nM
Citation
 Cherkasov, ABan, FSantos-Filho, OThorsteinson, NFallahi, MHammond, GL An updated steroid benchmark set and its application in the discovery of novel nanomolar ligands of sex hormone-binding globulin. J Med Chem 51:2047-56 (2008)  
Target
Name:
Sex hormone-binding globulin
Synonyms:
SHBG Testis-specific androgen-binding protein
Type:
PROTEIN
Mol. Mass.:
43780.19
Organism:
Homo sapiens (Human)
Description:
ChEMBL_466706
Residue:
402
  
Inhibitor
Name:
BDBM50423514
Synonyms:
16Alpha-Hydroxy-Testosterone | CHEMBL411316
Type:
Small organic molecule
Emp. Form.:
C19H28O3
Mol. Mass.:
304.4238
SMILES:
C[C@]12CC[C@H]3[C@@H](CCC4=CC(=O)CC[C@]34C)[C@@H]1C[C@@H](O)[C@@H]2O
: