Target
Beta-1 adrenergic receptor
Ligand
BDBM50423821
Substrate
Meas. Tech.
ChEMBL_770400 (CHEMBL1833709)
Kd
13±n/a nM
Citation
 Baker, JGAdams, LASalchow, KMistry, SNMiddleton, RJHill, SJKellam, B Synthesis and characterization of high-affinity 4,4-difluoro-4-bora-3a,4a-diaza-s-indacene-labeled fluorescent ligands for humanß-adrenoceptors. J Med Chem 54:6874-87 (2011)  
Target
Name:
Beta-1 adrenergic receptor
Synonyms:
ADRB1 ADRB1_HUMAN Beta-1 adrenoceptor adrenergic Beta1
Type:
G Protein-Coupled Receptor (GPCR)
Mol. Mass.:
51338.40
Organism:
Homo sapiens (Human)
Description:
P08588
Residue:
477
  
Inhibitor
Name:
BDBM50423821
Synonyms:
CHEMBL1830486
Type:
Small organic molecule
Emp. Form.:
C46H50BF2N5O5S
Mol. Mass.:
833.793
SMILES:
O[C@@H](CNCCCCNC(=O)CCCCCNC(=O)COc1ccc(\C=C\c2ccc3C=C4C=CC(c5cccs5)=[N+]4[B-](F)(F)n23)cc1)COc1cccc2ccccc12
: